{"text_format":"1","workbook":"xlsx","n_sheets":7,"sheets":["README","User_Interface","InputOutput calculations","CHP lookup matrix","Peaking Lookup matrix","Backup lookup matrix","Help"],"not_rendered":{"charts":0,"images":6,"macros":1,"external_links":0,"defined_names":15,"comments":0,"pivot_tables":0},"unopened":[],"bounds":{"document_bytes":16777216,"sheet_cells":100000,"rows_first":2000,"rows_last":500,"rows_between":2000,"halvings":0,"cell_chars":16384,"cell_head_chars":4096},"cells_cut":0,"cells_raw":0,"read":"whole","date_system":"1900"}

{"sheet":"README","index":0,"n_rows":27,"n_cols":3,"rows_kept":27,"cut":false,"hidden":false,"merged":[]}
[]
[]
[null,null,"VERSION DATE: December 2018"]
[null,null,"Air Quality Modelling and Assessment Unit (AQMAU)"]
[null,null,"Specified Generator Tranche B Screening Tool"]
[null,null,"Version 2.0"]
[]
[]
[null,null,"OVERVIEW:"]
[null,null,"This tool is for screening simple bespoke low risk Tranche B Specified Generators which cannot meet the available Standard Rules Permits.\nThe populated and run tool needs to be submitted as part of the simple bespoke application.\nTo use the tool the Tranche B Specified Generator needs to be:"]
[null,null,"• New or existing engines that can achieve the Medium Combustion Plant Directive and/or Specified Generator Emission Limit Values.\n• Fuelled on natural gas, that is, there are insignificant emissions of sulphur dioxide and particulates.\n• Or, ultra low sulphur diesel engines with secondary abatement (SCR), used for balancing (no more than 500 hours), and aggregated to no more than 20 MWth.\n• For mixed Tranche A and B Specified Generator sites, all Tranche A units must also comply with the Tranche B requirements.\n• All stacks must be vertical and unimpeded by cowls or caps."]
[]
[null,null,"Further information is provided in Environment Agency guidance 'Specified Generator Guidance' and 'Guidance on dispersion modelling for oxides of nitrogen assessment from specified generators'. To discuss any site or application please contact:"]
[null,null,"MCPDHelp@environment-agency.gov.uk"]
[]
[]
[null,null,"COPYRIGHT © 2018 ENVIRONMENT AGENCY ALL RIGHTS RESERVED"]
[null,null,"Redistribution of this tool and use in source and binary forms, with or without modification, are permitted provided that the following conditions are met: "]
[null,null,"1. Redistributions of source code must retain the above copyright notice, this list of conditions and the following disclaimer."]
[null,null,"2. Redistributions in binary form must reproduce the above copyright notice, this list of conditions and the following disclaimer in the documentation and/or other materials provided with the distribution."]
{"$rows_left_out":8}
{"sheet":"User_Interface","index":1,"n_rows":96,"n_cols":30,"rows_kept":96,"cut":false,"hidden":false,"merged":[[16,3,16,4],[16,6,17,6],[26,6,28,6],[30,3,30,4],[7,6,8,6],[13,3,13,4],[13,6,14,6],[95,3,95,6],[93,3,93,6],[7,3,7,4],[8,3,8,4],[58,3,58,4],[58,6,59,6],[30,6,31,6],[40,6,41,6],[43,3,43,4],[43,6,44,6],[10,6,11,6],[10,3,10,4],[19,6,20,6],[22,6,24,6],[23,3,23,4],[26,3,26,4],[52,3,52,4],[46,6,49,6],[51,6,53,6],[33,6,35,6],[78,6,80,6],[61,3,61,4],[64,3,64,4],[61,6,62,6],[64,6,65,6],[73,6,76,6],[67,6,68,6],[78,3,78,4],[74,3,74,4]]}
[]
[null,null,"Air Quality Modelling and Assessment Unit (AQMAU)"]
[null,null,"SPECIFIED GENERATOR TRANCHE B SCREENING TOOL"]
[null,null,{"$f":"README!C6","v":"Version 2.0"}]
[]
[null,null,"STEP1: GENERAL SITE INFORMATION"]
[null,null,null,null,null,null,null,null,null,null,null,null,null,null,null,null,null,null,null,null,null,null,null,null,null,"Type list","Yes/No","Existing/New","Background list","Fuel"]
[null,null,"Applicant name",null,null,null,"USER NOTES:\nPlease enter the name that will appear on the environmental permit.",null,null,null,null,null,null,null,null,null,null,null,null,null,null,null,null,null,null,"CHP","Yes","Existing","Rural","Natural gas"]
[null,null,null,null,null,null,null,null,null,null,null,null,null,null,null,null,null,null,null,null,null,null,null,null,null,"Peaking","No","New","Suburban","Diesel (ultra low sulphur)"]
[null,null,null,null,null,null,null,null,null,null,null,null,null,null,null,null,null,null,null,null,null,null,null,null,null,"Balancing",null,"Other","Industrial"]
[null,null,"Specified generator usage type category\n(Select from the drop-down list)","CHP",null,null,"USER NOTES:\nCHP - Combined heat and power plant typically used to provide mid-merit or base load electricity and therefore assumed to operate up to 8760 hours per year.\nPeaking - Peaking plant are used to provide power during grid peak demand periods and are assumed to operate between 501 and 1500 hours per year.\nBalancing - Balancing plant are considered to operate between 51 and 500 hours per year and are typically used to provide balancing power reserve to the grid.",null,null,null,null,null,null,null,null,null,null,null,null,null,null,null,null,null,null,null,null,null,"Urban"]
[]
[]
[null,null,"Fuel\n(Select from the drop-down list)","Natural gas",null,null,"USER NOTES:\nNatural gas - Can be used for screening of all usage types (CHP, Peaking and Balancing).\nDiesel (ultra low sulphur) - Can be used for screening for blancing operations only (between 51 and 500 hours per year)."]
[]
[]
[null,null,"Is it a mixed Tranche A and B Specified Generator site?\n(Select yes or no)","No",null,null,"USER NOTES:\nSelect yes, if there are any Tranche A generators on the Specified Generator site. If there are, then all Tranche A generators must comply with the Tranche B generator requirements.\nSelect no, if there are no Tranche A generators on the Specified Generator site."]
[]
[]
[null,null,"Specified generators aggregated rated thermal input",null,"MW",null,"USER NOTES:\nThis is the total aggregated thermal input of all generators on the Specified Generator site. It should include Tranche A and B generators for mixed sites.\nCHPs - Screening distances for up to 25 MWth aggregated plant have been calculated.\nPeaking and balancing plant - Screening distances for up to 50 MWth aggregated plant have been calculated.\n"]
{"$rows_left_out":77}
{"sheet":"InputOutput calculations","index":2,"n_rows":53,"n_cols":8,"rows_kept":53,"cut":false,"hidden":true,"merged":[]}
["User input data"]
["Type",{"$f":"User_Interface!D11","v":"CHP"}]
["Capacity",{"$f":"User_Interface!D20","v":0},"MW"]
["Fuel",{"$f":"User_Interface!D14","v":"Natural gas"}]
["Operational hours",{"$f":"IF(B2=\"CHP\",User_Interface!D23,IF(AND(B2=\"Peaking\",B8=\"No\"),User_Interface!D23,IF(AND(B2=\"Peaking\",B8=\"Yes\"),User_Interface!D23*1.5,IF(AND(B2=\"Balancing\",B8=\"No\"),User_Interface!D23,IF(AND(B2=\"Balancing\",B8=\"Yes\"),User_Interface!D23*1.5)))))","v":0},"hours per year"]
["CHP opertional hour scaled capacity",{"$f":"ROUND(B3*B5/8760,1)","v":0},"MW","Temporary fix for no opertional hour look-up tables for CHPs."]
["Balancing capacity",{"$f":"IF(B4=\"Natural gas\",B3,IF(B4=\"Diesel (ultra low sulphur)\",ROUND(B3*2.5,1)))","v":0},"MW","2.5 factor based on (unabated emission at 1850 mg/Nm3 for 10 minutes and 190 mg/Nm3 for 50 minutes)"]
["Rolling average",{"$f":"User_Interface!D24","v":"No"}]
["Secondary abatement",{"$f":"User_Interface!D31","v":"No"}]
["ELV",{"$f":"User_Interface!D35","v":190},"mg/Nm3"]
[]
["Stack height",{"$f":"User_Interface!D41","v":0},"m"]
[]
["Building height",{"$f":"User_Interface!D47","v":0},"m"]
["Building length",{"$f":"MAX(User_Interface!D48:D49)","v":0},"m"]
["Building width",{"$f":"MIN(User_Interface!D48:D49)","v":0},"m"]
[]
["Site setting",{"$f":"User_Interface!D59","v":"Rural"}]
["Busy Road",{"$f":"User_Interface!D62","v":"No"}]
["AQMA",{"$f":"User_Interface!D65","v":"No"}]
{"$rows_left_out":34}
{"sheet":"CHP lookup matrix","index":3,"n_rows":190,"n_cols":58,"rows_kept":190,"cut":false,"hidden":true,"merged":[]}
["Source group","Capacity","Stack height","Clearance","Background","Acceptable PC","Unique NO2 PC","NO2 Screening distance",null,null,"Source group","Capacity","Stack height","Clearance","Background","Acceptable PC","Unique NOX PC","NOX Screening distance",null,null,"Source group","Capacity","Stack height","Clearance","Background","Acceptable PC","Unique NO2 PC","NO2 Screening distance",null,null,"Source group","Capacity","Stack height","Clearance","Background","Acceptable PC","Unique NOX PC","NOX Screening distance",null,null,"Source group","Capacity","Stack height","Clearance","Background","Acceptable PC","Unique NO2 PC","NO2 Screening distance",null,null,"Source group","Capacity","Stack height","Clearance","Background","Acceptable PC","Unique NOX PC","NOX Screening distance"]
["CHP1",5,5,0,30,6,5.9234419999999988,100,null,null,"CHP1",5,5,0,"N/A",0.45,0.41722700000000001,850,null,null,"CHP1",5,5,0,30,6,4.7908980000000003,200,null,null,"CHP1",5,5,0,"N/A",0.45,0.44174999999999998,1300,{"$f":"MAX(AL2:AL64)","v":3100},null,"CHP1",5,5,0,30,6,3.9012252631578943,50,null,null,"CHP1",5,5,0,"N/A",0.45,0.3861163157894737,450]
["CHP1",5,5,0,35,3,2.3954490000000002,200,null,null,"CHP2",5,5,2.5,"N/A",0.45,0.41933799999999999,850,null,null,"CHP1",5,5,0,35,3,2.6418140000000001,300,null,null,"CHP2",5,5,2.5,"N/A",0.45,0.44534400000000007,1300,null,null,"CHP1",5,5,0,35,3,2.1823207368421045,100,null,null,"CHP2",5,5,2.5,"N/A",0.45,0.38520263157894741,450]
["CHP1",5,5,0,40,1.6,1.3209070000000001,300,null,null,"CHP3",5,10,0,"N/A",0.45,0.44250499999999998,800,null,null,"CHP1",5,5,0,40,1.6,1.4672419999999999,450,null,null,"CHP3",5,10,0,"N/A",0.45,0.41967000000000004,1300,null,null,"CHP1",5,5,0,40,1.6,1.3191702631578948,150,null,null,"CHP3",5,10,0,"N/A",0.45,0.3858621052631579,450]
["CHP2",5,5,2.5,30,6,5.2729599999999994,100,null,null,"CHP4",5,10,5,"N/A",0.45,0.41428599999999999,800,null,null,"CHP2",5,5,2.5,30,6,4.6495119999999996,200,null,null,"CHP4",5,10,5,"N/A",0.45,0.40715999999999997,1300,null,null,"CHP2",5,5,2.5,30,6,2.8555652631578945,50,null,null,"CHP4",5,10,5,"N/A",0.45,0.4019105263157895,400]
["CHP2",5,5,2.5,35,3,2.3247559999999998,200,null,null,"CHP5",5,20,0,"N/A",0.45,0.44538800000000001,750,null,null,"CHP2",5,5,2.5,35,3,2.6154380000000002,300,null,null,"CHP5",5,20,0,"N/A",0.45,0.43425999999999998,1200,null,null,"CHP2",5,5,2.5,35,3,2.8555652631578945,50,null,null,"CHP5",5,20,0,"N/A",0.45,0.41759052631578941,400]
["CHP2",5,5,2.5,40,1.6,1.3077190000000001,300,null,null,"CHP6",5,20,5,"N/A",0.45,0.43141600000000002,750,null,null,"CHP2",5,5,2.5,40,1.6,1.4637699999999998,450,null,null,"CHP6",5,20,5,"N/A",0.45,0.428124,1200,null,null,"CHP2",5,5,2.5,40,1.6,1.2464491052631579,150,null,null,"CHP6",5,20,5,"N/A",0.45,0.38624894736842103,400]
["CHP3",5,10,0,30,6,5.8450559999999996,100,null,null,"CHP7",5,20,10,"N/A",0.45,0.44858900000000002,650,null,null,"CHP3",5,10,0,30,6,4.8758639999999991,200,null,null,"CHP7",5,20,10,"N/A",0.45,0.431556,1100,null,null,"CHP3",5,10,0,30,6,2.6042984210526314,50,null,null,"CHP7",5,20,10,"N/A",0.45,0.38628210526315793,350]
["CHP3",5,10,0,35,3,2.4379319999999995,200,null,null,"CHP8",10,5,0,"N/A",0.45,0.42264200000000002,1200,null,null,"CHP3",5,10,0,35,3,2.666566,300,null,null,"CHP8",10,5,0,"N/A",0.45,0.43317599999999995,1900,null,null,"CHP3",5,10,0,35,3,2.6042984210526314,50,null,null,"CHP8",10,5,0,"N/A",0.45,0.4112905263157895,600]
["CHP3",5,10,0,40,1.6,1.333283,300,null,null,"CHP9",10,5,2.5,"N/A",0.45,0.42402099999999998,1200,null,null,"CHP3",5,10,0,40,1.6,1.4662760000000001,450,null,null,"CHP9",10,5,2.5,"N/A",0.45,0.43570000000000003,1900,null,null,"CHP3",5,10,0,40,1.6,1.3478765263157895,150,null,null,"CHP9",10,5,2.5,"N/A",0.45,0.41086315789473682,600]
["CHP4",5,10,5,30,6,2.5791989999999996,0,null,null,"CHP10",10,10,0,"N/A",0.45,0.39688699999999999,1200,null,null,"CHP4",5,10,5,30,6,5.2100859999999996,150,null,null,"CHP10",10,10,0,"N/A",0.45,0.43694400000000005,1800,null,null,"CHP4",5,10,5,30,6,0.95023121052631554,0,null,null,"CHP10",10,10,0,"N/A",0.45,0.44816578947368418,550]
["CHP4",5,10,5,35,3,2.6050429999999998,150,null,null,"CHP11",10,10,5,"N/A",0.45,0.44162200000000001,1100,null,null,"CHP4",5,10,5,35,3,2.9107959999999999,250,null,null,"CHP11",10,10,5,"N/A",0.45,0.43687399999999993,1800,null,null,"CHP4",5,10,5,35,3,0.95023121052631554,0,null,null,"CHP11",10,10,5,"N/A",0.45,0.41689789473684208,550]
["CHP4",5,10,5,40,1.6,1.455398,250,null,null,"CHP12",10,20,0,"N/A",0.45,0.43744100000000002,1100,null,null,"CHP4",5,10,5,40,1.6,1.5272599999999998,400,null,null,"CHP12",10,20,0,"N/A",0.45,0.41970000000000007,1800,null,null,"CHP4",5,10,5,40,1.6,0.95023121052631554,0,null,null,"CHP12",10,20,0,"N/A",0.45,0.44673263157894744,550]
["CHP5",5,20,0,30,6,4.3571569999999999,50,null,null,"CHP13",10,20,5,"N/A",0.45,0.41837099999999999,1100,null,null,"CHP5",5,20,0,30,6,4.4103639999999995,200,null,null,"CHP13",10,20,5,"N/A",0.45,0.44197799999999998,1700,null,null,"CHP5",5,20,0,30,6,1.6052683684210527,50,null,null,"CHP13",10,20,5,"N/A",0.45,0.40552842105263154,550]
["CHP5",5,20,0,35,3,2.2051819999999998,200,null,null,"CHP14",10,20,10,"N/A",0.45,0.44785900000000001,950,null,null,"CHP5",5,20,0,35,3,2.4380160000000002,300,null,null,"CHP14",10,20,10,"N/A",0.45,0.44022,1600,null,null,"CHP5",5,20,0,35,3,1.6052683684210527,50,null,null,"CHP14",10,20,10,"N/A",0.45,0.44466578947368418,450]
["CHP5",5,20,0,40,1.6,1.5986879999999999,250,null,null,"CHP15",15,5,0,"N/A",0.45,0.41188599999999997,1500,null,null,"CHP5",5,20,0,40,1.6,1.5868439999999997,400,null,null,"CHP15",15,5,0,"N/A",0.45,{"$error":"#N/A"},2400,null,null,"CHP5",5,20,0,40,1.6,1.3645545789473683,100,null,null,"CHP15",15,5,0,"N/A",0.45,0.43139526315789478,700]
["CHP6",5,20,5,30,6,1.0349359999999999,0,null,null,"CHP16",15,5,2.5,"N/A",0.45,0.41278700000000002,1500,null,null,"CHP6",5,20,5,30,6,2.0698719999999997,0,null,null,"CHP16",15,5,2.5,"N/A",0.45,{"$error":"#N/A"},2400,null,null,"CHP6",5,20,5,30,6,0.38129221052631573,0,null,null,"CHP16",15,5,2.5,"N/A",0.45,0.43110052631578943,700]
["CHP6",5,20,5,35,3,1.0349359999999999,0,null,null,"CHP17",15,10,0,"N/A",0.45,0.42246699999999998,1400,null,null,"CHP6",5,20,5,35,3,2.8533680000000006,250,null,null,"CHP17",15,10,0,"N/A",0.45,{"$error":"#N/A"},2200,null,null,"CHP6",5,20,5,35,3,0.38129221052631573,0,null,null,"CHP17",15,10,0,"N/A",0.45,0.40766157894736849,700]
["CHP6",5,20,5,40,1.6,1.4266840000000001,250,null,null,"CHP18",15,10,5,"N/A",0.45,0.42221399999999998,1400,null,null,"CHP6",5,20,5,40,1.6,1.4677459999999996,400,null,null,"CHP18",15,10,5,"N/A",0.45,{"$error":"#N/A"},2300,null,null,"CHP6",5,20,5,40,1.6,0.38129221052631573,0,null,null,"CHP18",15,10,5,"N/A",0.45,0.43261105263157895,650]
["CHP7",5,20,10,30,6,0.12268899999999999,0,null,null,"CHP19",15,20,0,"N/A",0.45,0.42024899999999998,1400,null,null,"CHP7",5,20,10,30,6,0.24537799999999999,0,null,null,"CHP19",15,20,0,"N/A",0.45,{"$error":"#N/A"},2300,null,null,"CHP7",5,20,10,30,6,4.5201210526315788E-2,0,null,null,"CHP19",15,20,0,"N/A",0.45,0.42252000000000001,700]
{"$rows_left_out":171}
{"sheet":"Peaking Lookup matrix","index":4,"n_rows":253,"n_cols":42,"rows_kept":253,"cut":false,"hidden":true,"merged":[]}
["Source group","Capacity","Stack height","Clearance ","Operational hours","Background","Acceptable PC","Unique NO2 PC","NO2 Screening distance",null,null,"Source group","Capacity","Stack height","Clearance ","Operational hours","Background","Acceptable PC","Unique NOX PC","NOX Screening distance",null,null,"Source group","Capacity","Stack height","Clearance ","Operational hours","Background","Acceptable PC","Unique NO2 PC","NO2 Screening distance",null,null,"Source group","Capacity","Stack height","Clearance ","Operational hours","Background","Acceptable PC","Unique NOX PC","NOX Screening distance"]
["Peak1",10,3,0,750,30,6,3.3045933219178076,50,null,null,"Peak1",10,3,0,750,"N/A",0.45,0.39063955479452062,300,null,null,"Peak1",10,3,0,750,30,6,2.8141797945205473,100,null,null,"Peak1",10,3,0,750,"N/A",0.45,0.43129109589041098,450]
["Peak1",10,3,0,750,35,3,1.4070898972602737,100,null,null,"Peak2",10,6,3,750,"N/A",0.45,0.36565924657534249,300,null,null,"Peak1",10,3,0,750,35,3,2.8141797945205473,100,null,null,"Peak2",10,6,3,750,"N/A",0.45,0.40474315068493155,450]
["Peak1",10,3,0,750,40,1.6,1.4070898972602737,100,null,null,"Peak3",10,10,7,750,"N/A",0.45,0.42579109589041092,250,null,null,"Peak1",10,3,0,750,40,1.6,1.5627619863013698,150,null,null,"Peak3",10,10,7,750,"N/A",0.45,0.43543150684931509,400]
["Peak2",10,6,3,750,30,6,1.9028193493150687,50,null,null,"Peak4",15,3,0,750,"N/A",0.45,0.41293407534246585,350,null,null,"Peak2",10,6,3,750,30,6,3.8056386986301374,50,null,null,"Peak4",15,3,0,750,"N/A",0.45,0.43036472602739723,550]
["Peak2",10,6,3,750,35,3,1.9028193493150687,50,null,null,"Peak5",15,6,3,750,"N/A",0.45,0.38895890410958911,350,null,null,"Peak2",10,6,3,750,35,3,2.3246832191780822,100,null,null,"Peak5",15,6,3,750,"N/A",0.45,0.40631849315068491,550]
["Peak2",10,6,3,750,40,1.6,1.1623416095890411,100,null,null,"Peak6",15,10,7,750,"N/A",0.45,0.44191523972602742,300,null,null,"Peak2",10,6,3,750,40,1.6,1.4024092465753426,150,null,null,"Peak6",15,10,7,750,"N/A",0.45,0.42636472602739728,500]
["Peak3",10,10,7,750,30,6,0.65804195205479454,0,null,null,"Peak7",20,3,0,750,"N/A",0.45,0.41379366438356158,400,null,null,"Peak3",10,10,7,750,30,6,1.3160839041095891,0,null,null,"Peak7",20,3,0,750,"N/A",0.45,0.4145958904109589,650]
["Peak3",10,10,7,750,35,3,0.65804195205479454,0,null,null,"Peak8",20,6,3,750,"N/A",0.45,0.39104452054794514,400,null,null,"Peak3",10,10,7,750,35,3,1.3160839041095891,0,null,null,"Peak8",20,6,3,750,"N/A",0.45,0.43999143835616439,600]
["Peak3",10,10,7,750,40,1.6,0.65804195205479454,0,null,null,"Peak9",20,10,7,750,"N/A",0.45,0.4353732876712329,350,null,null,"Peak3",10,10,7,750,40,1.6,1.3160839041095891,0,null,null,"Peak9",20,10,7,750,"N/A",0.45,0.40566952054794519,600]
["Peak4",15,3,0,750,30,6,3.9394957191780819,50,null,null,"Peak10",25,3,0,750,"N/A",0.45,0.40516181506849314,450,null,null,"Peak4",15,3,0,750,30,6,3.6024469178082192,100,null,null,"Peak10",25,3,0,750,"N/A",0.45,0.43546575342465754,700]
["Peak4",15,3,0,750,35,3,1.8012234589041096,100,null,null,"Peak11",25,6,3,750,"N/A",0.45,0.38373801369863009,450,null,null,"Peak4",15,3,0,750,35,3,2.0524743150684932,150,null,null,"Peak11",25,6,3,750,"N/A",0.45,0.41348801369863009,700]
["Peak4",15,3,0,750,40,1.6,1.0262371575342466,150,null,null,"Peak12",25,10,7,750,"N/A",0.45,0.41999657534246587,400,null,null,"Peak4",15,3,0,750,40,1.6,1.3400325342465753,200,null,null,"Peak12",25,10,7,750,"N/A",0.45,0.42438356164383567,650]
["Peak5",15,6,3,750,30,6,2.2478390410958902,50,null,null,"Peak13",30,3,0,750,"N/A",0.45,0.42910102739726019,550,null,null,"Peak5",15,6,3,750,30,6,4.4956780821917803,50,null,null,"Peak13",30,3,0,750,"N/A",0.45,0.4146695205479452,900]
["Peak5",15,6,3,750,35,3,2.2478390410958902,50,null,null,"Peak14",30,6,3,750,"N/A",0.45,0.40553767123287676,550,null,null,"Peak5",15,6,3,750,35,3,2.9520582191780824,100,null,null,"Peak14",30,6,3,750,"N/A",0.45,0.43083219178082194,850]
["Peak5",15,6,3,750,40,1.6,1.4760291095890408,100,null,null,"Peak15",30,10,7,750,"N/A",0.45,0.4261686643835616,500,null,null,"Peak5",15,6,3,750,40,1.6,1.2372619863013699,200,null,null,"Peak15",30,10,7,750,"N/A",0.45,0.43766267123287672,800]
["Peak6",15,10,7,750,30,6,0.76610445205479438,0,null,null,"Peak16",40,3,0,750,"N/A",0.45,0.41357106164383567,650,null,null,"Peak6",15,10,7,750,30,6,1.5322089041095888,0,null,null,"Peak16",40,3,0,750,"N/A",0.45,0.44106335616438358,1000]
["Peak6",15,10,7,750,35,3,0.76610445205479438,0,null,null,"Peak17",40,6,3,750,"N/A",0.45,0.4392397260273973,600,null,null,"Peak6",15,10,7,750,35,3,1.5322089041095888,0,null,null,"Peak17",40,6,3,750,"N/A",0.45,0.42172431506849317,1000]
["Peak6",15,10,7,750,40,1.6,0.76610445205479438,0,null,null,"Peak18",40,10,7,750,"N/A",0.45,0.40551883561643842,600,null,null,"Peak6",15,10,7,750,40,1.6,1.4597397260273974,150,null,null,"Peak18",40,10,7,750,"N/A",0.45,0.42474657534246574,950]
["Peak7",20,3,0,750,30,6,4.4100419520547938,50,null,null,"Peak19",50,3,0,750,"N/A",0.45,0.43450342465753428,700,null,null,"Peak7",20,3,0,750,30,6,4.2468784246575337,100,null,null,"Peak19",50,3,0,750,"N/A",0.45,0.39806164383561643,1200]
{"$rows_left_out":234}
{"sheet":"Backup lookup matrix","index":5,"n_rows":361,"n_cols":20,"rows_kept":361,"cut":false,"hidden":true,"merged":[]}
["Source group","Capacity","Stack height","Clearance","Operational hours","Background","Acceptable PC","Unique NO2 PC","NO2 Screening distance",null,null,"Source group","Capacity","Stack height","Clearance","Operational hours","Background","Acceptable PC","Unique NOX PC","NOX Screening distance"]
["Back22",5,3,0,100,30,140,64.782200000000003,50,null,null,"Back22",5,3,0,100,"N/A",45,44.799500000000002,100]
["Back23",5,6,3,100,30,140,37.962224999999997,50,null,null,"Back23",5,6,3,100,"N/A",45,39.204749999999997,100]
["Back24",5,10,7,100,30,140,13.526695,0,null,null,"Back24",5,10,7,100,"N/A",45,24.054099999999998,50]
["Back22",5,3,0,100,35,140,64.782200000000003,50,null,null,"Back22",5,3,0,200,"N/A",45,44.799500000000002,100]
["Back23",5,6,3,100,35,140,37.962224999999997,50,null,null,"Back23",5,6,3,200,"N/A",45,39.204749999999997,100]
["Back24",5,10,7,100,35,140,13.526695,0,null,null,"Back24",5,10,7,200,"N/A",45,24.054099999999998,50]
["Back22",5,3,0,100,40,140,64.782200000000003,50,null,null,"Back22",5,3,0,350,"N/A",0.45,0.33681906392694055,200]
["Back23",5,6,3,100,40,140,37.962224999999997,50,null,null,"Back23",5,6,3,350,"N/A",0.45,0.31119634703196353,200]
["Back24",5,10,7,100,40,140,13.526695,0,null,null,"Back24",5,10,7,350,"N/A",0.45,0.37487756849315074,150]
["Back22",5,3,0,200,30,140,74.207699999999988,50,null,null,"Back22",5,3,0,500,"N/A",0.45,0.34241438356164383,250]
["Back23",5,6,3,200,30,140,44.474674999999998,50,null,null,"Back23",5,6,3,500,"N/A",0.45,0.44456621004566216,200]
["Back24",5,10,7,200,30,140,16.276487499999998,0,null,null,"Back24",5,10,7,500,"N/A",0.45,0.38209474885844746,200]
["Back22",5,3,0,200,35,140,74.207699999999988,50,null,null,"Back22",5,3,0,750,"N/A",0.45,0.39063955479452062,300]
["Back23",5,6,3,200,35,140,44.474674999999998,50,null,null,"Back23",5,6,3,750,"N/A",0.45,0.36565967465753424,300]
["Back24",5,10,7,200,35,140,16.276487499999998,0,null,null,"Back24",5,10,7,750,"N/A",0.45,0.42579109589041092,250]
["Back22",5,3,0,200,40,140,74.207699999999988,50,null,null,"Back1",10,3,0,100,"N/A",45,41.164349999999999,200]
["Back23",5,6,3,200,40,140,44.474674999999998,50,null,null,"Back2",10,6,3,100,"N/A",45,37.487900000000003,200]
["Back24",5,10,7,200,40,140,16.276487499999998,0,null,null,"Back3",10,10,7,100,"N/A",45,39.570900000000002,150]
["Back22",5,3,0,350,30,140,78.4602,50,null,null,"Back1",10,3,0,200,"N/A",45,41.164349999999999,200]
{"$rows_left_out":342}
{"sheet":"Help","index":6,"n_rows":117,"n_cols":5,"rows_kept":117,"cut":false,"hidden":false,"merged":[[107,2,107,5],[110,2,110,5],[113,2,113,5],[116,2,116,5],[1,0,103,0],[105,0,117,0],[100,2,100,5],[3,2,3,5],[6,2,6,5],[35,2,35,5],[106,1,117,1],[37,2,37,5],[45,2,45,5],[74,2,74,5],[76,2,76,5],[79,2,79,5],[102,2,102,5]]}
[]
[null,null,"BUILDINGS THAT COULD AFFECT DISPERSION"]
[]
[null,null,"All buildings that could affect dispersion need to be considered during screening. This includes the building on which the stack is located.\n\nBuildings that could affect dispersion from a stack are any building that is both:\n• within 5L of the stack\n• has a height more than 40% of the stack height\n\nFor each building 'L' is the lowest of either:\n• the height of the building\n• the maximum projected width, which is the greatest width between 2 points (for example opposing corners of a roof)\n\nWhere there are multiple buildings that could affect dispersion, they should be combined into a simplified block. The height of the simplified block should be set to the tallest building."]
[]
[null,null,"Example 1"]
[null,null,"A 20 m stack is located on a 17 m building (Building A).  There is another 19 m high building nearby, 14 m from the stack (Building B)."]
[]
[null,null,null,"Building A","Building B"]
[null,null,"Height (m)",17,19]
[null,null,"Length (m)",20,30]
[null,null,"Width (m)",10,20]
[null,null,"Max projected width (m)",{"$f":"(D11^2+D12^2)^0.5","v":22.360679774997898},{"$f":"(E11^2+E12^2)^0.5","v":36.055512754639892}]
[null,null,"L (m)",{"$f":"MIN(D10,D13)","v":17},{"$f":"MIN(E10,E13)","v":19}]
[null,null,"5L (m)",{"$f":"D14*5","v":85},{"$f":"E14*5","v":95}]
[null,null,"Distance from stack (m)",0,14]
[null,null,"Building height/stack height",{"$f":"D10/20","v":0.85},{"$f":"E10/20","v":0.95}]
[]
[]
[]
{"$rows_left_out":97}